Carte macrosismique
type: Result
type: Concept
description: A map of earthquake ground motion showing the geographical distribution of ground shaking as described by a specific parameter such as peak acceleration (écrit Shake map) @en
description: Spatial representation of the ground motion generated by an earthquake as described by different parameters such as macro-seismic intensities, PGA, PGV or PSA. @en
description: Représentation spatiale du mouvement du sol généré par un séisme, tel que décrit par différents paramètres (intensité macrosismique, PGA, PGV, PSA)
source: wats / GFZ
in scheme: product
preferred label: Shakemap @en
top concept of: product

Sismologie
type: Collection
member: Carte macrosismique