TerraSar
type: Concept
description: TerraSAR-X, an imaging radar Earth observation satellite, is a joint venture being carried out under a public-private-partnership between the German Aerospace Center (DLR) and EADS Astrium. The exclusive commercial exploitation rights are held by the geo-information service provider Astrium. TerraSAR-X was launched on 15 June 2007 and has been in operational service since January 2008. With its twin satellite TanDEM-X, launched 21 June 2010, TerraSAR-X acquires the data basis for the WorldDEM, the worldwide and homogeneous DEM available from 2014.
description: TerraSAR-X est un satellite radar d'observation de la Terre construit dans le cadre d'un partenariat public-privé entre le Centre aérospatial allemand (DLR) et EADS Astrium. TerraSAR-X est lancé le 15 juin 2007 et il est opérationnel depuis janvier 2008. Avec son satellite jumeau TanDEM-X, lancé le 21 juin 2010, TerraSAR-X acquiert la base de données WorldDEM, le modèle numérique d’élévation global. Les droits d'exploitation commerciale exclusifs sont détenus par Infoterra GmbH, une filiale à 100% d'EADS Astrium. @fr
notation: P010800
broader: Earth Observation Satellites
in scheme: Platforms

Earth Observation Satellites
type: Concept
label: Satellites d'observation @fr
narrower: TerraSar

Platforms
type: Container
type: Register
type: ConceptScheme
type: Ontology
label: Plateformes @fr