RADARSAT
type: Concept
description: Radarsat, a Canadian-led international program and a major part of the overall Canadian Space Agency (CSA) program, is Canada's first remote-sensing satellite. Radarsat delivers C-Band SAR imagery to the CSA and numerous commercial customers worldwide.
notation: P010700
broader: Earth Observation Satellites
in scheme: Platforms

Earth Observation Satellites
type: Concept
label: Satellites d'observation @fr
narrower: RADARSAT

Platforms
type: Container
type: Register
type: ConceptScheme
type: Ontology
label: Plateformes @fr