Satellites d'observation
type: Concept
label: Earth Observation Satellites @en
narrower: ENVISAT

ENVISAT
type: Concept
description: ENVISAT was successfully launched on March 1, 2002 from Kourou, French Guiana on Europe's Ariane 5 launcher. The ENVIronmental SATellite (ENVISAT) is an element of the European Space Agency (ESA) Columbus Programme.
notation: P010600
broader: Satellites d'observation
in scheme: Plateformes

Plateformes
type: Container
type: Register
type: ConceptScheme
type: Ontology
label: Platforms @en