Sismologie
type: Collection
member: Choc principal

Choc principal
type: FeatureOfInterest
type: Concept
description: Le plus fort tremblement de terre dans un groupe de séismes. Les chocs principaux sont parfois précédés de "précurseurs", et sont généralement suivis de répliques.
description: The largest earthquake in an earthquake sequence, sometimes preceded by one or more foreshocks, and almost always followed by many aftershocks @en
source: epos
in scheme: FOI
preferred label: mainshock @en
top concept of: FOI