Sismologie
type: Collection
member: Séisme

Séisme
type: FeatureOfInterest
type: Concept
description: A shaking of the Earth that is either tectonic or volcanic in origin or caused by collapse of cavities in the Earth. A tectonic earthquake is caused by fault slip. @en
description: Motion on a fault that generates more or less strong shaking on the ground surface. @en
description: Mouvement sur une faille qui génère des secousses plus ou moins fortes à la surface du sol.
source: wats
alternative label: Tremblement de terre
in scheme: FOI
preferred label: Earthquake @en
top concept of: FOI