Sismologie
type: Collection
member: Épicentre macrosismique

Épicentre macrosismique
type: FeatureOfInterest
type: Concept
description: Position of highest intensities. It can be different from the microseismic epicentre because surface effects such as the presence of alluvium or relief can amplify seismic waves. @en
description: Lieu de plus forte intensité ressentie. Il peut être différent de l’épicentre microsismique car les effets de surface comme la présence d’alluvions ou le relief peuvent amplifier les ondes sismiques localement.
source: wats
in scheme: FOI
preferred label: Macroseismic epicenter @en
top concept of: FOI