Sismologie
type: Collection
member: Limite de plaque

Limite de plaque
type: Concept
type: FeatureOfInterest
description: The zone of diffuse deformation, often marked by a distribution of seismicity, active faulting, and rough topography, within which relative plate motion is accommodated. Plate boundary zones are typically narrow under oceans and broad under continents. @en
description: to do
source: GFZ
in scheme: FOI
preferred label: Plate-boundary (zone) @en
top concept of: FOI
status: submitted