Volcano
type: FeatureOfInterest
type: Concept
narrower: Piton de la Fournaise
preferred label: Volcan @fr

Piton de la Fournaise
type: FeatureOfInterest
type: Concept
description: Volcan situé sur l'île de la Réunion. @fr
broader: Volcano
in scheme: FOI