Aire macrosismique
type: Concept
type: FeatureOfInterest
description: Zone géographique dans laquelle l'intensité du séisme est supérieure ou égale à une valeur donnée (exemple : l'aire macrosismique d'intensité IV est la zone où l'intensité observée est supérieure ou égale à IV)
description: Geographical area in which the intensity of the earthquake is greater than or equal to a given value (example: the macro-seismic area of intensity IV is the area where the observed intensity is greater than or equal to IV) @en
source: wats
in scheme: FOI
preferred label: Macroseismic aera @en
top concept of: FOI

Sismologie
type: Collection
member: Aire macrosismique