Processus volcaniques
type: FeatureOfInterest
type: Concept
description: to do
description: Volcanic bomb, volcanic block, volcanic degassing, volcanic glass, volcanic plume, volcanic tremor, volcanic unrest, volcanic vent @en
source: GFZ
in scheme: FOI
preferred label: Volcanic processes @en
top concept of: FOI
status: submitted

Sismologie
type: Collection
member: Processus volcaniques