Épicentre
type: FeatureOfInterest
type: Concept
description: Point à la surface de la terre situé à la verticale du foyer du séisme (point d’initiation du séisme, appelé hypocentre).
description: Point on the Earth's surface vertically above the earthquake focus (earthquake-rupture initiation point called the hypocenter). @en
source: wats
in scheme: FOI
preferred label: Epicenter @en
top concept of: FOI

Sismologie
type: Collection
member: Épicentre