Rupture de surface
type: Concept
type: FeatureOfInterest
description: Faulting that reaches the Earth’s surface; commonly accompanies moderate and large earthquakes having focal depths less than 20 km. The faulting is almost always coseismic, however it may also accompany aseismic tectonic creep or natural or man-induced subsidence @en
description: to do
source: GFZ
in scheme: FOI
preferred label: Surface faulting @en
top concept of: FOI
status: submitted

Sismologie
type: Collection
member: Rupture de surface