Gllissement de terrain
type: FeatureOfInterest
type: Concept
description: Landslide: the down-slope movement of soil and/or rock. @en
description: Un glissement de terrain est un phénomène d'origine sismique, géologique et géophysique où une masse de terre descend sur une pente, autrement dit un plan de glissement, qui peut être plus ou moins continu, et plus ou moins incurvé.
source: hal-resif
in scheme: FOI
preferred label: Landslide instability @en
top concept of: FOI

Sismologie
type: Collection
member: Gllissement de terrain