Séquence de tremblements de terre
type: FeatureOfInterest
type: Concept
description: A series of earthquakes originating in the same (wider) locality, such as aftershocks, earthquake swarms, but sometimes also a sequence of consecutive mainshocks. @en
description: to do
source: epos
in scheme: FOI
preferred label: Earthquake sequence @en
top concept of: FOI
status: submitted

Sismologie
type: Collection
member: Séquence de tremblements de terre