Disciplines and theme for Solid Earth
label: Disciplines et thèmes pour la Terre Solide @fr
type: Container
type: Register
type: ConceptScheme
type: Ontology

Geomagnetism
type: Concept
notation: D030000
label: Géomagnétisme @fr
description: Le magnétisme terrestre @fr
description: The magnetism of the earth. Also known as terrestrial magnetism.
in scheme: Disciplines and theme for Solid Earth
top concept of: Disciplines and theme for Solid Earth