Géodésie
preferred label: Geodetics @en
in scheme: Disciplines et thèmes pour la Terre Solide
type: Concept
top concept of: Disciplines et thèmes pour la Terre Solide
notation: D020000
description: The scientific discipline that deals with the measurement and representation of the earth, its gravitational field and geodynamic phenomena (polar motion, earth tides, and tectonic motion) in three-dimensional, time-varying space. @en
description: La géodésie est la science qui étudie les dimensions et la forme de la Terre, ainsi que son champ de pesanteur. Son objectif principal est d'élaborer des systèmes de référence terrestres auxquels tout utilisateur ou créateur de données géoréférencées peut accéder par l'intermédiaire de réseaux.

Disciplines et thèmes pour la Terre Solide
label: Disciplines and theme for Solid Earth @en
type: Container
type: Register
type: ConceptScheme
type: Ontology