Geochemistry
preferred label: Géochimie @fr
description: Pertaining to the study of the chemical composition of the various phases of the earth, and the physical and chemical processes which have produced the observed distribution of the elements and the nuclides in these phases
description: Science qui étudie la composition chimique de la croûte terrestre. @fr
notation: D010000
in scheme: Disciplines and theme for Solid Earth
top concept of: Disciplines and theme for Solid Earth
type: Concept

Disciplines and theme for Solid Earth
label: Disciplines et thèmes pour la Terre Solide @fr
type: Container
type: Register
type: ConceptScheme
type: Ontology