Disciplines and theme for Solid Earth
type: Container
type: Register
type: ConceptScheme
type: Ontology
label: Disciplines et thèmes pour la Terre Solide @fr

Geomorphology
type: Concept
label: Géomorphologie @fr
narrower: Surface water processes/measurements

Surface water processes/measurements
type: Concept
description: Surface-water hydrology is a field that encompasses all surface waters of the globe (overland flows, rivers, lakes, wetlands, estuaries, oceans, etc.). This is a subset of the hydrologic cycle that does not include atmospheric, and ground waters. Surface-water hydrology relates the dynamics of flow in surface-water systems (rivers, canals, streams, lakes, ponds, wetlands, marshes, arroyos, oceans, etc.). This includes the field measurement of flow (discharge); the statistical variability at each setting; floods; drought susceptibility and the development of the levels of risk; and the fluid mechanics of surface waters.
description: à faire @fr
notation: D040700
label: Processus et mesures des eaux de suface @fr
broader: Geomorphology
in scheme: Disciplines and theme for Solid Earth