Disciplines and theme for Solid Earth
type: Container
type: Register
type: ConceptScheme
type: Ontology
label: Disciplines et thèmes pour la Terre Solide @fr

Geodetics
type: Concept
description: The scientific discipline that deals with the measurement and representation of the earth, its gravitational field and geodynamic phenomena (polar motion, earth tides, and tectonic motion) in three-dimensional, time-varying space.
description: La géodésie est la science qui étudie les dimensions et la forme de la Terre, ainsi que son champ de pesanteur. Son objectif principal est d'élaborer des systèmes de référence terrestres auxquels tout utilisateur ou créateur de données géoréférencées peut accéder par l'intermédiaire de réseaux. @fr
notation: D020000
label: Géodésie @fr
in scheme: Disciplines and theme for Solid Earth
top concept of: Disciplines and theme for Solid Earth